{"text_format":"1","workbook":"xlsx","n_sheets":9,"sheets":["Disclaimer","Deckblatt","Input form-EingabeMaske","Questions-Fragen","Report-Bericht","Actionplan-Massnahmenplan","Historie","Sprachen","Ampel"],"not_rendered":{"charts":0,"images":7,"macros":1,"external_links":0,"defined_names":37,"comments":0,"pivot_tables":0},"unopened":[],"bounds":{"document_bytes":16777216,"sheet_cells":100000,"rows_first":2000,"rows_last":500,"rows_between":2000,"halvings":0,"cell_chars":16384,"cell_head_chars":4096},"cells_cut":0,"cells_raw":0,"read":"whole","date_system":"1900"}

{"sheet":"Disclaimer","index":0,"n_rows":1,"n_cols":1,"rows_kept":1,"cut":false,"hidden":false,"merged":[]}
[{"$f":"VLOOKUP(pos(A1),Sprachen!$A$400:$P$499,Sprachen!$A$3,0)","v":"VDA QMC \nDISCLAIMER:\n\nThe VDA QMC provides  this Excel file  for the reporting of VDA 6.3 audits. The  sole responsibility for this Excel report remains with the user. \nThe VDA and the developers of this file are not responsible for the accuracy of the calculations and the proposed capability ratings.\n\nTo avoid damage to the formulas contained within the evaluation matrix we recommend you only use the input areas as given. This is explained in detail in detail in the seminar. \nThe user is not entitled to support or updates of this report file from the VDA QMC or the developers. \n\nVDA QMC  Nov. 2016\n"}]

{"sheet":"Deckblatt","index":1,"n_rows":20,"n_cols":7,"rows_kept":20,"cut":false,"hidden":false,"merged":[[10,1,10,3]]}
[]
[{"$f":"'Report-Bericht'!R3","v":"Audit Report VDA 6.3 Potential Analysis"}]
[]
[]
[{"$f":"'Input form-EingabeMaske'!F59","v":"Audit Organisation:"},null,null,null,null,{"$f":"'Input form-EingabeMaske'!B25","v":"Supplier:"}]
[]
[{"$f":"IF('Input form-EingabeMaske'!G59=\"\",\"\",'Input form-EingabeMaske'!G59)","v":""},null,null,null,null,{"$f":"IF('Input form-EingabeMaske'!Lieferant=\"\",\"\",'Input form-EingabeMaske'!Lieferant)","v":""}]
[]
[null,null,null,null,null,{"$f":"IF('Input form-EingabeMaske'!Lief_Ort=\"\",\"\",'Input form-EingabeMaske'!Lief_Ort)","v":""}]
[]
[null,{"$f":"IF('Input form-EingabeMaske'!C16=0,\"\",'Input form-EingabeMaske'!C16)","v":""},null,null,null,{"$f":"IF('Input form-EingabeMaske'!B15=\"\",\"\",'Input form-EingabeMaske'!B15)","v":""},{"$f":"IF('Input form-EingabeMaske'!C15=0,\"\",'Input form-EingabeMaske'!C15)","v":""}]
[]
[]
[{"$f":"'Input form-EingabeMaske'!B52","v":"Distribution Internal"},null,null,null,{"$f":"'Input form-EingabeMaske'!B44","v":"Distribution at the audited organisation"}]
[{"$f":"IF('Input form-EingabeMaske'!C52=0,\"\",'Input form-EingabeMaske'!C52)","v":"Name:"},{"$f":"IF('Input form-EingabeMaske'!D52=0,\"\",'Input form-EingabeMaske'!D52)","v":"Department:"},null,null,{"$f":"IF('Input form-EingabeMaske'!C45=0,\"\",'Input form-EingabeMaske'!C45)","v":"Name:"},null,{"$f":"IF('Input form-EingabeMaske'!D45=0,\"\",'Input form-EingabeMaske'!D45)","v":"Department:"}]
{"$rows_left_out":6}
{"sheet":"Input form-EingabeMaske","index":2,"n_rows":61,"n_cols":10,"rows_kept":61,"cut":false,"hidden":false,"merged":[[41,10,41,13],[8,8,9,9],[17,2,17,6],[19,5,19,6],[20,5,20,6],[22,8,28,9],[18,5,18,6],[27,2,27,3],[43,5,43,6],[22,2,22,3],[23,2,23,3],[24,2,24,3],[25,2,25,3],[26,2,26,3],[28,2,28,3],[29,2,29,3],[30,2,30,3],[33,1,33,2],[31,2,31,3]]}
[null,{"$f":"VLOOKUP(pos(B1),Sprachen!$A$4:$P$100,Sprachen!$A$3,0)","v":"Data Input for Compiling Report"}]
[]
[null,{"$f":"VLOOKUP(pos(B3),Sprachen!$A$4:$P$100,Sprachen!$A$3,0)","v":"Short Instruction:"},null,{"$f":"VLOOKUP(pos(D3),Sprachen!$A$4:$P$100,Sprachen!$A$3,0)","v":"Language"}]
[null,{"$f":"VLOOKUP(pos(B4),Sprachen!$A$4:$P$100,Sprachen!$A$3,0)","v":"1. Activate macros"}]
[null,{"$f":"VLOOKUP(pos(B5),Sprachen!$A$4:$P$100,Sprachen!$A$3,0)","v":"2. Select Language"}]
[null,{"$f":"VLOOKUP(pos(B6),Sprachen!$A$4:$P$100,Sprachen!$A$3,0)","v":"3. Choose amount of projects (max. 3)"}]
[]
[]
[null,{"$f":"VLOOKUP(pos(B9),Sprachen!$A$4:$P$100,Sprachen!$A$3,0)","v":"Order:"},null,null,null,null,null,null,{"$f":"VLOOKUP(pos(I9),Sprachen!$A$4:$P$100,Sprachen!$A$3,0)","v":"Input in purple areas"},{"$f":"VLOOKUP(pos(J9),Sprachen!$A$4:$P$100,Sprachen!$A$3,0)","v":{"$error":"#N/A"}}]
[null,{"$f":"VLOOKUP(pos(B10),Sprachen!$A$4:$P$100,Sprachen!$A$3,0)","v":"Date:"},null,null,null,null,null,null,{"$f":"VLOOKUP(pos(I10),Sprachen!$A$4:$P$100,Sprachen!$A$3,0)","v":{"$error":"#N/A"}},{"$f":"VLOOKUP(pos(J10),Sprachen!$A$4:$P$100,Sprachen!$A$3,0)","v":{"$error":"#N/A"}}]
[]
[]
[null,{"$f":"VLOOKUP(pos(B13),Sprachen!$A$4:$P$100,Sprachen!$A$3,0)","v":"Potential Analysis VDA 6.3 Revision 2016"}]
[]
[]
{"$rows_left_out":47}
{"sheet":"Questions-Fragen","index":3,"n_rows":68,"n_cols":30,"rows_kept":68,"cut":false,"hidden":false,"merged":[[9,5,9,14],[7,6,7,7],[21,2,21,4],[22,2,22,4],[23,2,23,4],[24,2,24,4],[25,2,25,4],[26,2,26,4],[27,2,27,4],[29,2,29,4],[30,2,30,4],[32,2,32,4],[33,2,33,4],[34,2,34,4],[36,2,36,4],[37,2,37,4],[38,2,38,4],[39,2,39,4],[40,2,40,4],[43,2,43,4],[45,2,45,4],[46,2,46,4],[47,2,47,4],[48,2,48,4],[50,2,50,4],[51,2,51,4],[53,2,53,4],[54,2,54,4],[55,2,55,4],[64,2,64,4],[65,2,65,4],[66,2,66,4],[67,2,67,4],[56,2,56,4],[58,2,58,4],[59,2,59,4],[61,2,61,4],[62,2,62,4]]}
[]
[{"$f":"'Report-Bericht'!R3","v":"Audit Report VDA 6.3 Potential Analysis"},null,null,null,null,null,null,null,null,null,{"$f":"F10","v":"Overview ratings"}]
[null,null,null,null,null,null,null,null,null,null,null,null,null,null,null,null,null,null,null,null,null,null,null,null,null,null,null,null,{"$f":"VLOOKUP(pos(AC3),Sprachen!$A$201:$P$360,Sprachen!$A$3,0)","v":"ALL \"GREEN\""}]
[null,null,{"$f":"'Report-Bericht'!AD9","v":"Order:"},{"$f":"IF('Input form-EingabeMaske'!C9=0,\"\",'Input form-EingabeMaske'!C9)","v":""},null,null,{"$f":"IF('Input form-EingabeMaske'!C9=\"\",\"\",'Input form-EingabeMaske'!C9)","v":""},null,null,null,null,null,null,null,null,null,null,null,null,null,null,null,null,null,null,null,null,null,{"$f":"VLOOKUP(pos(AC4),Sprachen!$A$201:$P$360,Sprachen!$A$3,0)","v":"ALL \"n.e.\""}]
[null,null,{"$f":"'Report-Bericht'!C5","v":"Supplier:"},{"$f":"IF('Input form-EingabeMaske'!Lieferant=0,\"\",'Input form-EingabeMaske'!Lieferant)","v":""},null,null,{"$f":"IF('Input form-EingabeMaske'!Lieferant=\"\",\"\",'Input form-EingabeMaske'!Lieferant)","v":""}]
[null,null,{"$f":"'Input form-EingabeMaske'!B23","v":"Suppl.-No.:"},{"$f":"IF('Input form-EingabeMaske'!LieferantNr=0,\"\",'Input form-EingabeMaske'!LieferantNr)","v":""},null,null,{"$f":"IF('Input form-EingabeMaske'!LieferantNr=\"\",\"\",'Input form-EingabeMaske'!LieferantNr)","v":""}]
[null,null,{"$f":"'Report-Bericht'!C9","v":"Location:"},{"$f":"IF('Input form-EingabeMaske'!Lief_Ort=0,\"\",'Input form-EingabeMaske'!Lief_Ort)","v":""},null,null,{"$f":"IF('Input form-EingabeMaske'!Lief_Ort=\"\",\"\",'Input form-EingabeMaske'!Lief_Ort)","v":""}]
[null,null,{"$f":"'Report-Bericht'!AD7","v":"Date:"},{"$f":"IF('Input form-EingabeMaske'!C10=0,\"\",'Input form-EingabeMaske'!C10)","v":""},null,null,{"$f":"IF('Input form-EingabeMaske'!C10=\"\",\"\",'Input form-EingabeMaske'!C10)","v":""}]
[]
[null,null,null,null,null,{"$f":"VLOOKUP(pos(F10),Sprachen!$A$201:$P$360,Sprachen!$A$3,0)","v":"Overview ratings"},{"$f":"VLOOKUP(pos(G10),Sprachen!$A$201:$P$360,Sprachen!$A$3,0)","v":{"$error":"#N/A"}},{"$f":"VLOOKUP(pos(H10),Sprachen!$A$201:$P$360,Sprachen!$A$3,0)","v":{"$error":"#N/A"}},{"$f":"VLOOKUP(pos(I10),Sprachen!$A$201:$P$360,Sprachen!$A$3,0)","v":{"$error":"#N/A"}},{"$f":"VLOOKUP(pos(J10),Sprachen!$A$201:$P$360,Sprachen!$A$3,0)","v":{"$error":"#N/A"}},{"$f":"VLOOKUP(pos(K10),Sprachen!$A$201:$P$360,Sprachen!$A$3,0)","v":{"$error":"#N/A"}},{"$f":"VLOOKUP(pos(L10),Sprachen!$A$201:$P$360,Sprachen!$A$3,0)","v":{"$error":"#N/A"}},{"$f":"VLOOKUP(pos(M10),Sprachen!$A$201:$P$360,Sprachen!$A$3,0)","v":{"$error":"#N/A"}},{"$f":"VLOOKUP(pos(N10),Sprachen!$A$201:$P$360,Sprachen!$A$3,0)","v":{"$error":"#N/A"}},{"$f":"VLOOKUP(pos(O10),Sprachen!$A$201:$P$360,Sprachen!$A$3,0)","v":{"$error":"#N/A"}},null,null,null,null,null,null,null,null,null,null,null,null,null,{"$f":"VLOOKUP(pos(AC10),Sprachen!$A$201:$P$360,Sprachen!$A$3,0)","v":"GREEN"},{"$f":"AC12","v":"RED"}]
[null,null,null,null,null,null,null,{"$f":"COUNTIF(H22:H68,$AD$10)","v":0},null,null,{"$f":"COUNTIF(K22:K68,$AD$10)","v":0},null,null,{"$f":"COUNTIF(N22:N68,$AD$10)","v":0},null,null,null,null,null,null,null,null,null,null,null,null,null,null,{"$f":"VLOOKUP(pos(AC11),Sprachen!$A$201:$P$360,Sprachen!$A$3,0)","v":"YELLOW"},{"$f":"AC11","v":"YELLOW"}]
[null,null,null,null,null,null,null,{"$f":"COUNTIF(H22:H68,$AD$11)","v":1},null,null,{"$f":"COUNTIF(K22:K68,$AD$11)","v":0},null,null,{"$f":"COUNTIF(N22:N68,$AD$11)","v":0},null,null,null,null,null,null,null,null,null,null,null,null,null,null,{"$f":"VLOOKUP(pos(AC12),Sprachen!$A$201:$P$360,Sprachen!$A$3,0)","v":"RED"},{"$f":"AC10","v":"GREEN"}]
[null,null,null,null,null,null,null,{"$f":"COUNTIF(H22:H68,$AD$12)","v":35},null,null,{"$f":"COUNTIF(K22:K68,$AD$12)","v":0},null,null,{"$f":"COUNTIF(N22:N68,$AD$12)","v":0},null,null,null,null,null,null,null,null,null,null,null,null,null,null,{"$f":"VLOOKUP(pos(AC13),Sprachen!$A$201:$P$360,Sprachen!$A$3,0)","v":"n.e."},{"$f":"AC13","v":"n.e."}]
[null,null,null,null,null,null,null,{"$f":"COUNTIF(H22:H68,$AD$13)","v":0},null,null,{"$f":"COUNTIF(K22:K68,$AD$13)","v":36},null,null,{"$f":"COUNTIF(N22:N68,$AD$13)","v":36},null,null,null,null,null,null,null,null,null,null,null,null,null,null,null,{"$f":"VLOOKUP(pos(AD14),Sprachen!$A$201:$P$360,Sprachen!$A$3,0)","v":">>n.e. rated"}]
[]
{"$rows_left_out":54}
{"sheet":"Report-Bericht","index":4,"n_rows":57,"n_cols":34,"rows_kept":57,"cut":false,"hidden":false,"merged":[[56,3,56,5],[18,21,20,31],[23,21,24,31],[26,21,32,31],[34,21,45,31],[25,10,25,17],[28,2,30,17],[20,2,20,5],[35,2,35,3],[36,2,36,3],[37,2,37,3],[34,2,34,3],[34,5,34,8],[35,5,35,8],[36,5,36,8],[37,5,37,8],[41,2,41,3],[49,2,49,3],[49,5,49,8],[49,10,49,15],[45,5,45,8],[46,2,46,3],[47,2,47,3],[46,10,46,15],[47,10,47,15],[47,5,47,8],[46,5,46,8],[41,5,41,8],[41,10,41,15],[42,2,42,3],[42,5,42,8],[42,10,42,15],[51,7,51,8],[51,10,51,11],[48,2,48,3],[48,5,48,8],[48,10,48,15],[43,2,43,3],[43,5,43,8],[43,10,43,15],[44,10,44,15],[45,10,45,15],[44,5,44,8],[44,2,44,3],[45,2,45,3],[17,2,17,5],[23,2,23,3],[24,2,24,3],[25,2,25,3],[33,2,33,3],[25,5,25,7],[33,5,33,8],[24,5,24,7],[18,2,18,5],[19,2,19,5],[23,5,23,7],[33,10,33,15],[34,10,34,15],[35,10,35,15],[36,10,36,15],[37,10,37,15],[24,10,24,17],[18,7,18,8],[18,10,18,11],[19,7,19,8],[19,10,19,11],[20,7,20,8],[20,10,20,11],[55,22,55,26],[55,29,55,31],[4,2,4,3],[16,7,16,13],[10,24,10,27],[10,21,10,22],[8,21,8,22],[6,21,6,22],[6,2,6,17],[13,3,13,15],[16,2,16,4],[46,21,46,31],[48,30,48,31],[17,7,17,8],[17,10,17,11],[23,10,23,17]]}
[]
[]
[null,null,null,null,null,null,null,null,null,null,null,null,null,null,null,null,null,{"$f":"VLOOKUP(pos(R3),Sprachen!$A$141:$P$180,Sprachen!$A$3,0)","v":"Audit Report VDA 6.3 Potential Analysis"}]
[]
[null,null,{"$f":"'Input form-EingabeMaske'!B25","v":"Supplier:"}]
[]
[null,null,{"$f":"IF('Input form-EingabeMaske'!C25=\"\",\"\",'Input form-EingabeMaske'!C25)","v":""},null,null,null,null,null,null,null,null,null,null,null,null,null,null,null,null,null,null,{"$f":"'Input form-EingabeMaske'!B24","v":" D-U-N-S No.:"},null,null,{"$f":"IF('Input form-EingabeMaske'!C23=\"\",\"\",'Input form-EingabeMaske'!C23)","v":""},null,null,{"$f":"IF('Input form-EingabeMaske'!DUNS_Nr=\"\",\"\",'Input form-EingabeMaske'!DUNS_Nr)","v":""},null,{"$f":"'Input form-EingabeMaske'!B10","v":"Date:"},{"$f":"IF('Input form-EingabeMaske'!C10=\"\",\"\",'Input form-EingabeMaske'!C10)","v":""},null,null,"00:00:00"]
[]
[null,null,{"$f":"'Input form-EingabeMaske'!B27","v":"Location:"},null,null,null,null,null,null,null,null,null,null,null,null,null,null,null,null,null,null,{"$f":"'Input form-EingabeMaske'!B19","v":"Order-requestor:"},null,null,{"$f":"IF('Input form-EingabeMaske'!C19=\"\",\"\",'Input form-EingabeMaske'!C19)","v":""},null,null,{"$f":"IF('Input form-EingabeMaske'!F19=\"\",\"\",'Input form-EingabeMaske'!F19)","v":""},null,{"$f":"'Input form-EingabeMaske'!B9","v":"Order:"},{"$f":"IF('Input form-EingabeMaske'!C9=\"\",\"\",'Input form-EingabeMaske'!C9)","v":""}]
[]
[null,null,{"$f":"IF('Input form-EingabeMaske'!C26=\"\",\"\",'Input form-EingabeMaske'!C26)","v":""},null,null,null,null,null,null,null,null,null,null,null,null,null,null,null,null,null,null,{"$f":"'Input form-EingabeMaske'!B18","v":"Audit Reason:"},null,null,{"$f":"IF('Input form-EingabeMaske'!C18=\"\",\"\",'Input form-EingabeMaske'!C18)","v":""}]
[null,null,{"$f":"IF('Input form-EingabeMaske'!C30=\"\",\"\",'Input form-EingabeMaske'!C30)","v":""},{"$f":"IF('Input form-EingabeMaske'!C27=\"\",\"\",'Input form-EingabeMaske'!C27)","v":""}]
[]
[null,null,{"$f":"'Input form-EingabeMaske'!B28","v":"Country:"},{"$f":"IF('Input form-EingabeMaske'!C28=\"\",\"\",'Input form-EingabeMaske'!C28)","v":""}]
[]
{"$rows_left_out":43}
{"sheet":"Actionplan-Massnahmenplan","index":5,"n_rows":130,"n_cols":26,"rows_kept":130,"cut":false,"hidden":false,"merged":[[39,2,39,6],[90,2,90,6],[103,2,103,6],[110,2,110,6],[117,2,117,6],[49,2,49,6],[65,2,65,6],[66,2,66,6],[70,2,70,6],[83,2,83,6],[4,1,4,3],[5,1,5,3],[8,4,8,6],[8,8,8,15],[32,2,32,6],[10,2,10,6]]}
[null,null,null,null,null,null,null,null,null,null,null,null,null,null,null,null,null,null,null,null,null,null,null,null,null,{"$f":"VLOOKUP(pos(Z1),Sprachen!$A$121:$P$140,Sprachen!$A$3,0)","v":"Show all rows"}]
[null,null,null,null,null,null,null,null,null,null,null,null,null,null,null,null,null,null,null,null,null,null,null,null,null,{"$f":"VLOOKUP(pos(Z2),Sprachen!$A$121:$P$140,Sprachen!$A$3,0)","v":"Copy sheet to new file"}]
[{"$f":"VLOOKUP(pos(A3),Sprachen!$A$121:$P$140,Sprachen!$A$3,0)","v":"Action plan"}]
[]
[null,{"$f":"'Input form-EingabeMaske'!B25","v":"Supplier:"},null,null,{"$f":"IF('Input form-EingabeMaske'!Lieferant=\"\",\"\",'Input form-EingabeMaske'!Lieferant)","v":""},null,null,null,null,null,null,{"$f":"'Input form-EingabeMaske'!B9","v":"Order:"},null,{"$f":"IF('Input form-EingabeMaske'!C9=\"\",\"\",'Input form-EingabeMaske'!C9)","v":""}]
[null,{"$f":"'Input form-EingabeMaske'!B27","v":"Location:"},null,null,{"$f":"IF('Input form-EingabeMaske'!Lief_Ort=\"\",\"\",'Input form-EingabeMaske'!Lief_Ort)","v":""},null,null,null,null,null,null,{"$f":"'Input form-EingabeMaske'!B10","v":"Date:"},null,{"$f":"TODAY()","v":"2021-01-28"}]
[]
[]
[null,null,null,null,{"$f":"VLOOKUP(pos(E9),Sprachen!$A$121:$P$140,Sprachen!$A$3,0)","v":"Filled in  by the auditor in the questionnaire"},{"$f":"VLOOKUP(pos(F9),Sprachen!$A$121:$P$140,Sprachen!$A$3,0)","v":{"$error":"#N/A"}},{"$f":"VLOOKUP(pos(G9),Sprachen!$A$121:$P$140,Sprachen!$A$3,0)","v":{"$error":"#N/A"}},null,{"$f":"VLOOKUP(pos(I9),Sprachen!$A$121:$P$140,Sprachen!$A$3,0)","v":"filled in by the audited area"},{"$f":"VLOOKUP(pos(J9),Sprachen!$A$121:$P$140,Sprachen!$A$3,0)","v":{"$error":"#N/A"}},{"$f":"VLOOKUP(pos(K9),Sprachen!$A$121:$P$140,Sprachen!$A$3,0)","v":{"$error":"#N/A"}},{"$f":"VLOOKUP(pos(L9),Sprachen!$A$121:$P$140,Sprachen!$A$3,0)","v":{"$error":"#N/A"}},{"$f":"VLOOKUP(pos(M9),Sprachen!$A$121:$P$140,Sprachen!$A$3,0)","v":{"$error":"#N/A"}},{"$f":"VLOOKUP(pos(N9),Sprachen!$A$121:$P$140,Sprachen!$A$3,0)","v":{"$error":"#N/A"}},{"$f":"VLOOKUP(pos(O9),Sprachen!$A$121:$P$140,Sprachen!$A$3,0)","v":{"$error":"#N/A"}},{"$f":"VLOOKUP(pos(P9),Sprachen!$A$121:$P$140,Sprachen!$A$3,0)","v":{"$error":"#N/A"}}]
[{"$f":"VLOOKUP(pos(A10),Sprachen!$A$121:$P$140,Sprachen!$A$3,0)","v":"Question"},null,{"$f":"VLOOKUP(pos(C10),Sprachen!$A$121:$P$140,Sprachen!$A$3,0)","v":"Project ID"},null,{"$f":"VLOOKUP(pos(E10),Sprachen!$A$121:$P$140,Sprachen!$A$3,0)","v":"Findings"},null,{"$f":"VLOOKUP(pos(G10),Sprachen!$A$121:$P$140,Sprachen!$A$3,0)","v":"Validation"},null,{"$f":"VLOOKUP(pos(I10),Sprachen!$A$121:$P$140,Sprachen!$A$3,0)","v":"Reason(s)"},{"$f":"VLOOKUP(pos(J10),Sprachen!$A$121:$P$140,Sprachen!$A$3,0)","v":"Measure(s)"},null,{"$f":"VLOOKUP(pos(L10),Sprachen!$A$121:$P$140,Sprachen!$A$3,0)","v":"Date"},null,{"$f":"VLOOKUP(pos(N10),Sprachen!$A$121:$P$140,Sprachen!$A$3,0)","v":"Respon-sibility"},null,{"$f":"VLOOKUP(pos(P10),Sprachen!$A$121:$P$140,Sprachen!$A$3,0)","v":"Effec-tivity"}]
[{"$f":"'Questions-Fragen'!B21","v":"P2"},null,{"$f":"'Questions-Fragen'!C21","v":"Project Management"}]
["P2.1",null,{"$f":"'Questions-Fragen'!H$20","v":0},null,{"$f":"'Questions-Fragen'!P22","v":0},null,{"$f":"'Questions-Fragen'!$H22","v":"GREEN"}]
["P2.1",null,{"$f":"'Questions-Fragen'!K$20","v":0},null,{"$f":"'Questions-Fragen'!R22","v":0},null,{"$f":"'Questions-Fragen'!$K22","v":"n.e."}]
["P2.1",null,{"$f":"'Questions-Fragen'!N$20","v":0},null,{"$f":"'Questions-Fragen'!T22","v":0},null,{"$f":"'Questions-Fragen'!$N22","v":"n.e."}]
["P2.2",null,{"$f":"'Questions-Fragen'!H20","v":0},null,{"$f":"'Questions-Fragen'!P23","v":0},null,{"$f":"'Questions-Fragen'!$H23","v":"GREEN"}]
{"$rows_left_out":116}
{"sheet":"Historie","index":6,"n_rows":28,"n_cols":8,"rows_kept":28,"cut":false,"hidden":false,"merged":[[0,0,0,2]]}
["Änderungshistorie"]
[]
[]
["Anforderung von: ","Datum","Aufgabe","Umsetzung","Termin","Kommentar","Status"]
["T.M.","25.07.2016","Berichtsbasis: Potenzialanalyse2016 Arbeitsstand 160725","INFO"]
["T.M.","25.07.2016","Erstellung von folgenden Funktionen:\n\n- Auswahl des Projektes in der Eingabemaske  und Bewertungsmaske (max. 3 Projekte können im Rahmen des Berichts bewertet werden)\n\n","PG","möglichst bis  Mi. 27.07.2016",null,"erledigt","Sobald in der Eingabemaske bei D41 bzw. E41 eine Projektbezeichnung eingetragen wird, erscheinen bei den Fragen die entsprechenden Spalten."]
["T.M.","25.07.2016","Fragen & Bewertung:  \nErstellung einer Ampeldarstellung im Bewertungsfeld \n \n","PG","möglichst bis  Mi. 27.07.2016","Ist-Stand:","erledigt","Ist leider nur in einer zusätzl. Spalte möglich, da die Ampel nur mit Zahlen verknüpft werden kann!"]
["T.M.","25.07.2016","Massnahmenplan: \n- Möglichkeit des Ausblendens von  Grün bewerteten Fragen ( Keine Massnahme definiert)\n\n- Automatische Anpassung der Zeilenhöhe. \n- Funktion Kopieerstellung des Massnahmenplans in Excel für die Übermittlung an die auditierte Organisation ( Lieferant)","PG","möglichst bis  Mi. 27.07.2016",null,"erledigt"]
["T.M.","25.07.2016","Erstellung der Mehrsprachigkeit ( S-Verweis)\n\n-Integration der folgenden Tabellen aus dem VDA Auditbericht: Eingabemaske ( wenn sinnvoll) , Sprachen, VA-Texte.","PG",null,"bitte wenn möglich erste Aktionen im Laufe des AK Termins 26--28.07. vorstellen.","weitegehend fertig","Es fehlen nur noch vereinzelt Verknüpfungen, die bisher übersehen wurden"]
["T.M.","25.10.2016","1) Wenn zuviele Bewertungen auf n.B. gesetzt werden, darf kein Endergebnis im Berichtsformular erscheinen.\n\n2) Leere Felder (Einträge auf dem Berichtsblatt zu Auditteilnehmern und im Unterschriftfeld zeigen eine \"0\"","PG",null,"wenn möglich bis 09.11.16","erledigt"]
["T.M.","25.10.2016","Integration der Funktion : Alle Bewertungen auf n.b. und Alle Bewertungen auf GRÜN","PG",null,"wenn möglich bis 09.11.16","erledigt"]
["TM","17.11.2016","Ergänzung der Sprachenspalten um : Japanese , French, Turkish, Korean, Italian, Polish, Swedish, sowie Umbenennung aller Sprachen auf engl.","PG","möglichst bis 18.11.16","Wunsch aus AK am 15.11.16","erledigt"]
["TM","2016-11-17","Kurzanleitung  (Tabelle : Input form-Eingabemaske Felder B2 -B6) mit S-Verweis verknüpfen (Einträge habe ich bereits in deutsch und englisch in der Sprachentabelle eingebracht)","PG","möglichst bis 18.11.16",null,"erledigt"]
["TM","2016-11-17","Ergänzung eines neuen Feldes Tabelle : Inputform-Eingabemaske Felder I20, J20)  :Zertifikat Nr:  hierfür wird ein S-Verweis benötigt.  Die Zertifikat Nr.soll auf dem Berichtsblatt (Unterschriftfeld) erscheinen als Nachweis, dass es sich um einen zertifizierten Prozessauditor handelt.","PG","möglichst bis 18.11.16","Wunsch aus AK am 15.11.16","erledigt"]
["TM","2016-11-17","Wenn im Tabellenblatt : Questions-Fragen die Funktion : \"alle Fragen mit GRÜN bewerten\" genutzt wird, erscheint auf dem Report- Bericht für alle Projekte eine GRÜN Einstufung, auch wenn nur ein Projekt ausgewählt wurde.","PG","möglichst bis 18.11.16","Fehler","erledigt"]
{"$rows_left_out":14}
{"sheet":"Sprachen","index":7,"n_rows":400,"n_cols":18,"rows_kept":400,"cut":false,"hidden":true,"merged":[]}
[]
["English"]
[{"$f":"MATCH(A2,B3:P3,0)+1","v":3},"German","English","French","Italian","Spanish","Português","Czech","Polish","Swedish","Turkish","Russian","Japanese","Korean","Blattname",null,null,"Sprachen"]
[{"$f":"pos('Input form-EingabeMaske'!B1)","v":"$B$1"},"Dateneingabe zur Berichtserstellung  ","Data Input for Compiling Report","Saisie des données pour la création du rapport","Inserimento dati per compilazione report","Introducción de datos para cumplimentación del informe","Introdução de dados para elaboração de relatório","Zadání dat pro vytvoření zprávy","Wprowadzanie danych do kompilowania raportu","Datainmatning för rapportgenrering","Rapor hazırlama için veri girişi","Ввод данных для составления отчета","報告書を編集するためのデータ入力","보고서 작성 자료 입력","EingabeMaske",null,null,"German"]
[{"$f":"pos('Input form-EingabeMaske'!D3)","v":"$D$3"},"Sprache wählen:","Language","Langue","Lingua","Idioma","Idioma","Zvolit jazyk:","Wybór języka:","Välj språk","Dil seçiniz:","Язык:","言語","언어","EingabeMaske",null,null,"English"]
[{"$f":"pos('Input form-EingabeMaske'!B9)","v":"$B$9"},"Auftrag:","Order:","Commande:","Ordine:","Informe:","Pedido","Zakázka","Zlecenie nr:","Ordernummer:","Sipariş No:","Заказ:","指令：","오더:","EingabeMaske",null,null,"French"]
[{"$f":"pos('Input form-EingabeMaske'!B10)","v":"$B$10"},"Datum:","Date:","Date:","Data:","Fecha:","Data","Datum:","Data:","Datum:","Tarih:","Дата:","日付：","일자:","EingabeMaske",null,null,"Italian"]
[{"$f":"pos('Input form-EingabeMaske'!B18)","v":"$B$18"},"Auftragsgrund:","Audit Reason:","Raison de l'audit:","Motivo dell'audit:","Motivo de la auditoría:","Motivo da auditoria:","Důvod auditu:","Powód auditu:","Orsak till revision:","Görev sebebi:","Причина:","監査理由：","심사사유:","EingabeMaske",null,null,"Spanish"]
[{"$f":"pos('Input form-EingabeMaske'!B19)","v":"$B$19"},"Auftraggeber:","Order-requestor:","Donneur d'ordres:","Richiedente l'ordine:","Peticionario:","Solicitante:","Zadavatel:","Zleceniodawca auditu:","Revisionsbegäran:","Görevlendiren:","Заказчик:","指令-要求者：","오더요청자:","EingabeMaske",null,null,"Portuguese"]
[{"$f":"pos('Input form-EingabeMaske'!B20)","v":"$B$20"},"Auditor:","Auditor:","Auditeur:","Auditor:","Auditor:","Auditor:","Auditor:","Auditor:","Revisor:","Denetçi:","Аудитор:","監査員：","심사원:","EingabeMaske",null,null,"Czech"]
[{"$f":"pos('Input form-EingabeMaske'!B21)","v":"$B$21"},"Leiter der Audit Organisation:","Audit manager:","Responsable de l'audit:","Responsabile dell'audit:","Director de la organización auditada:","Gestor da entidade auditada:","Vedoucí auditované organizace:","Auditor wiodący:","Chef för reviderad organisation","Denetleyen organizasyonun yöneticisi:","Руководитель аудиторской организации:","監査責任者：","심사관리자:","EingabeMaske",null,null,"Polish"]
[{"$f":"pos('Input form-EingabeMaske'!B23)","v":"$B$23"},"Lief.-Nr.:","Suppl.-No.:","N° du fournisseur:","Fornitore Nr.:","Nº de proveedor:","Número do  fornecedor:","Č.dodavatele:","Numer dostawcy:","Leverantörsnummer:","Tedarikçi numarası:","№ поставки:","サプライヤーNo.:","공급업체NO.","EingabeMaske",null,null,"Swedish"]
[{"$f":"pos('Input form-EingabeMaske'!B24)","v":"$B$24"},"DUNS-Nr.:"," D-U-N-S No.:","N° D-U-N-S:"," Numero D-U-N-S:","Nº DUNS:","D&B D-U-N-S® Number:","D&B D-U-N-S® Number:","Numer D-U-N-S: ","D-U-N-S Nr.:","D-U-N-S no.:","№ D-U-N-S®:"," D-U-N-S No.:"," D-U-N-S No.:","EingabeMaske",null,null,"Turkish"]
[{"$f":"pos('Input form-EingabeMaske'!B25)","v":"$B$25"},"Lieferant:","Supplier:","Fournisseur:","Fornitore:","Proveedor:","Fornecedor:","Dodavatel:","Dostawca:","Leverantör","Tedarikçi:","Поставщик:","サプライヤー：","공급업체:","EingabeMaske",null,null,"Japanese"]
[{"$f":"pos('Input form-EingabeMaske'!B26)","v":"$B$26"},"Straße:","Street:","Rue:","Via:","Calle:","Rua:","Ulice:","Ulica:","Gata","Cadde:","Улица, дом:","通り：","도로명:","EingabeMaske",null,null,"Korean"]
{"$rows_left_out":386}
{"sheet":"Ampel","index":8,"n_rows":7,"n_cols":5,"rows_kept":7,"cut":false,"hidden":true,"merged":[[2,1,3,2],[2,3,2,4]]}
[]
[]
[null,{"$f":"VLOOKUP(pos(B3),Sprachen!$A$181:$N$200,Sprachen!$A$3,0)","v":"Overall rating"},null,{"$f":"VLOOKUP(pos(D3),Sprachen!$A$181:$N$200,Sprachen!$A$3,0)","v":"Assessment "},{"$f":"VLOOKUP(pos(E3),Sprachen!$A$181:$N$200,Sprachen!$A$3,0)","v":{"$error":"#N/A"}}]
[null,null,null,{"$f":"VLOOKUP(pos(D4),Sprachen!$A$181:$N$200,Sprachen!$A$3,0)","v":"Yellow"},{"$f":"VLOOKUP(pos(E4),Sprachen!$A$181:$N$200,Sprachen!$A$3,0)","v":"Red"}]
[null,{"$f":"VLOOKUP(pos(B5),Sprachen!$A$181:$N$200,Sprachen!$A$3,0)","v":"Barred supplier"},"l",{"$f":"VLOOKUP(pos(D5),Sprachen!$A$181:$N$200,Sprachen!$A$3,0)","v":"more than 14"},{"$f":"VLOOKUP(pos(E5),Sprachen!$A$181:$N$200,Sprachen!$A$3,0)","v":"from 1"}]
[null,{"$f":"VLOOKUP(pos(B6),Sprachen!$A$181:$N$200,Sprachen!$A$3,0)","v":"Controlled supplier"},"l",{"$f":"VLOOKUP(pos(D6),Sprachen!$A$181:$N$200,Sprachen!$A$3,0)","v":"max. 14"},{"$f":"VLOOKUP(pos(E6),Sprachen!$A$181:$N$200,Sprachen!$A$3,0)","v":"none"}]
[null,{"$f":"VLOOKUP(pos(B7),Sprachen!$A$181:$N$200,Sprachen!$A$3,0)","v":"Approved supplier"},"l",{"$f":"VLOOKUP(pos(D7),Sprachen!$A$181:$N$200,Sprachen!$A$3,0)","v":"max. 7"},{"$f":"VLOOKUP(pos(E7),Sprachen!$A$181:$N$200,Sprachen!$A$3,0)","v":"none"}]